[aerogear-dev] Java-Jenkins-client API

classic Classic list List threaded Threaded
4 messages Options
Reply | Threaded
Open this post in threaded view
|  
Report Content as Inappropriate

[aerogear-dev] Java-Jenkins-client API

Matthias Wessendorf
Hi,

on the digger_dev branch, I get:

[ERROR] COMPILATION ERROR : 
[INFO] -------------------------------------------------------------
[ERROR] /home/Matthias/Work/AeroGear/java-client-api/jenkins-client-it-docker/src/test/java/com/offbytwo/jenkins/integration/NoExecutorStartedManageCredentialsIT.java:[85,9] cannot find symbol
  symbol:   class AppleDeveloperProfileCredential
  location: class com.offbytwo.jenkins.integration.NoExecutorStartedManageCredentialsIT
[ERROR] /home/Matthias/Work/AeroGear/java-client-api/jenkins-client-it-docker/src/test/java/com/offbytwo/jenkins/integration/NoExecutorStartedManageCredentialsIT.java:[85,63] cannot find symbol
  symbol:   class AppleDeveloperProfileCredential
  location: class com.offbytwo.jenkins.integration.NoExecutorStartedManageCredentialsIT
[INFO] 2 errors 
[INFO] -------------------------------------------------------------
[INFO] ------------------------------------------------------------------------
[INFO] Reactor Summary:
[INFO] 
[INFO] Jenkins API client for Java ........................ SUCCESS [  1.810 s]
[INFO] Jenkins API client for Java :: The Client. ......... SUCCESS [ 12.036 s]
[INFO] Jenkins API client for Java :: IT Docker ........... FAILURE [  0.236 s]
[INFO] ------------------------------------------------------------------------
[INFO] BUILD FAILURE
[INFO] ------------------------------------------------------------------------
[INFO] Total time: 14.336 s
[INFO] Finished at: 2017-08-02T13:36:27+02:00
[INFO] Final Memory: 61M/1356M
[INFO] ------------------------------------------------------------------------
[ERROR] Failed to execute goal org.apache.maven.plugins:maven-compiler-plugin:3.6.0:testCompile (default-testCompile) on project jenkins-client-it-docker: Compilation failure: Compilation failure:
[ERROR] /home/Matthias/Work/AeroGear/java-client-api/jenkins-client-it-docker/src/test/java/com/offbytwo/jenkins/integration/NoExecutorStartedManageCredentialsIT.java:[85,9] cannot find symbol
[ERROR] symbol:   class AppleDeveloperProfileCredential
[ERROR] location: class com.offbytwo.jenkins.integration.NoExecutorStartedManageCredentialsIT
[ERROR] /home/Matthias/Work/AeroGear/java-client-api/jenkins-client-it-docker/src/test/java/com/offbytwo/jenkins/integration/NoExecutorStartedManageCredentialsIT.java:[85,63] cannot find symbol
[ERROR] symbol:   class AppleDeveloperProfileCredential
[ERROR] location: class com.offbytwo.jenkins.integration.NoExecutorStartedManageCredentialsIT
[ERROR] -> [Help 1]
[ERROR] 
[ERROR] To see the full stack trace of the errors, re-run Maven with the -e switch.
[ERROR] Re-run Maven using the -X switch to enable full debug logging.
[ERROR] 





--

_______________________________________________
aerogear-dev mailing list
[hidden email]
https://lists.jboss.org/mailman/listinfo/aerogear-dev
Reply | Threaded
Open this post in threaded view
|  
Report Content as Inappropriate

Re: [aerogear-dev] Java-Jenkins-client API

Wei Li
I am looking into this now.

On Wed, Aug 2, 2017 at 12:38 PM, Matthias Wessendorf <[hidden email]> wrote:
Hi,

on the digger_dev branch, I get:

[ERROR] COMPILATION ERROR : 
[INFO] -------------------------------------------------------------
[ERROR] /home/Matthias/Work/AeroGear/java-client-api/jenkins-client-it-docker/src/test/java/com/offbytwo/jenkins/integration/NoExecutorStartedManageCredentialsIT.java:[85,9] cannot find symbol
  symbol:   class AppleDeveloperProfileCredential
  location: class com.offbytwo.jenkins.integration.NoExecutorStartedManageCredentialsIT
[ERROR] /home/Matthias/Work/AeroGear/java-client-api/jenkins-client-it-docker/src/test/java/com/offbytwo/jenkins/integration/NoExecutorStartedManageCredentialsIT.java:[85,63] cannot find symbol
  symbol:   class AppleDeveloperProfileCredential
  location: class com.offbytwo.jenkins.integration.NoExecutorStartedManageCredentialsIT
[INFO] 2 errors 
[INFO] -------------------------------------------------------------
[INFO] ------------------------------------------------------------------------
[INFO] Reactor Summary:
[INFO] 
[INFO] Jenkins API client for Java ........................ SUCCESS [  1.810 s]
[INFO] Jenkins API client for Java :: The Client. ......... SUCCESS [ 12.036 s]
[INFO] Jenkins API client for Java :: IT Docker ........... FAILURE [  0.236 s]
[INFO] ------------------------------------------------------------------------
[INFO] BUILD FAILURE
[INFO] ------------------------------------------------------------------------
[INFO] Total time: 14.336 s
[INFO] Finished at: 2017-08-02T13:36:27+02:00
[INFO] Final Memory: 61M/1356M
[INFO] ------------------------------------------------------------------------
[ERROR] Failed to execute goal org.apache.maven.plugins:maven-compiler-plugin:3.6.0:testCompile (default-testCompile) on project jenkins-client-it-docker: Compilation failure: Compilation failure:
[ERROR] /home/Matthias/Work/AeroGear/java-client-api/jenkins-client-it-docker/src/test/java/com/offbytwo/jenkins/integration/NoExecutorStartedManageCredentialsIT.java:[85,9] cannot find symbol
[ERROR] symbol:   class AppleDeveloperProfileCredential
[ERROR] location: class com.offbytwo.jenkins.integration.NoExecutorStartedManageCredentialsIT
[ERROR] /home/Matthias/Work/AeroGear/java-client-api/jenkins-client-it-docker/src/test/java/com/offbytwo/jenkins/integration/NoExecutorStartedManageCredentialsIT.java:[85,63] cannot find symbol
[ERROR] symbol:   class AppleDeveloperProfileCredential
[ERROR] location: class com.offbytwo.jenkins.integration.NoExecutorStartedManageCredentialsIT
[ERROR] -> [Help 1]
[ERROR] 
[ERROR] To see the full stack trace of the errors, re-run Maven with the -e switch.
[ERROR] Re-run Maven using the -X switch to enable full debug logging.
[ERROR] 





--

_______________________________________________
aerogear-dev mailing list
[hidden email]
https://lists.jboss.org/mailman/listinfo/aerogear-dev



--

WEI LI

SENIOR SOFTWARE ENGINEER

Red Hat Mobile

[hidden email]    M: <a href="tel:+353862393272" style="color:rgb(0,136,206);font-size:11px;margin:0px" target="_blank">+353862393272    


_______________________________________________
aerogear-dev mailing list
[hidden email]
https://lists.jboss.org/mailman/listinfo/aerogear-dev
Reply | Threaded
Open this post in threaded view
|  
Report Content as Inappropriate

Re: [aerogear-dev] Java-Jenkins-client API

Wei Li
@Matthias: https://github.com/aerogear/java-client-api/pull/6

On Wed, Aug 2, 2017 at 12:44 PM, Wei Li <[hidden email]> wrote:
I am looking into this now.

On Wed, Aug 2, 2017 at 12:38 PM, Matthias Wessendorf <[hidden email]> wrote:
Hi,

on the digger_dev branch, I get:

[ERROR] COMPILATION ERROR : 
[INFO] -------------------------------------------------------------
[ERROR] /home/Matthias/Work/AeroGear/java-client-api/jenkins-client-it-docker/src/test/java/com/offbytwo/jenkins/integration/NoExecutorStartedManageCredentialsIT.java:[85,9] cannot find symbol
  symbol:   class AppleDeveloperProfileCredential
  location: class com.offbytwo.jenkins.integration.NoExecutorStartedManageCredentialsIT
[ERROR] /home/Matthias/Work/AeroGear/java-client-api/jenkins-client-it-docker/src/test/java/com/offbytwo/jenkins/integration/NoExecutorStartedManageCredentialsIT.java:[85,63] cannot find symbol
  symbol:   class AppleDeveloperProfileCredential
  location: class com.offbytwo.jenkins.integration.NoExecutorStartedManageCredentialsIT
[INFO] 2 errors 
[INFO] -------------------------------------------------------------
[INFO] ------------------------------------------------------------------------
[INFO] Reactor Summary:
[INFO] 
[INFO] Jenkins API client for Java ........................ SUCCESS [  1.810 s]
[INFO] Jenkins API client for Java :: The Client. ......... SUCCESS [ 12.036 s]
[INFO] Jenkins API client for Java :: IT Docker ........... FAILURE [  0.236 s]
[INFO] ------------------------------------------------------------------------
[INFO] BUILD FAILURE
[INFO] ------------------------------------------------------------------------
[INFO] Total time: 14.336 s
[INFO] Finished at: 2017-08-02T13:36:27+02:00
[INFO] Final Memory: 61M/1356M
[INFO] ------------------------------------------------------------------------
[ERROR] Failed to execute goal org.apache.maven.plugins:maven-compiler-plugin:3.6.0:testCompile (default-testCompile) on project jenkins-client-it-docker: Compilation failure: Compilation failure:
[ERROR] /home/Matthias/Work/AeroGear/java-client-api/jenkins-client-it-docker/src/test/java/com/offbytwo/jenkins/integration/NoExecutorStartedManageCredentialsIT.java:[85,9] cannot find symbol
[ERROR] symbol:   class AppleDeveloperProfileCredential
[ERROR] location: class com.offbytwo.jenkins.integration.NoExecutorStartedManageCredentialsIT
[ERROR] /home/Matthias/Work/AeroGear/java-client-api/jenkins-client-it-docker/src/test/java/com/offbytwo/jenkins/integration/NoExecutorStartedManageCredentialsIT.java:[85,63] cannot find symbol
[ERROR] symbol:   class AppleDeveloperProfileCredential
[ERROR] location: class com.offbytwo.jenkins.integration.NoExecutorStartedManageCredentialsIT
[ERROR] -> [Help 1]
[ERROR] 
[ERROR] To see the full stack trace of the errors, re-run Maven with the -e switch.
[ERROR] Re-run Maven using the -X switch to enable full debug logging.
[ERROR] 





--

_______________________________________________
aerogear-dev mailing list
[hidden email]
https://lists.jboss.org/mailman/listinfo/aerogear-dev



--

WEI LI

SENIOR SOFTWARE ENGINEER

Red Hat Mobile

[hidden email]    M: <a href="tel:+353862393272" style="color:rgb(0,136,206);font-size:11px;margin:0px" target="_blank">+353862393272    




--

WEI LI

SENIOR SOFTWARE ENGINEER

Red Hat Mobile

[hidden email]    M: <a href="tel:+353862393272" style="color:rgb(0,136,206);font-size:11px;margin:0px" target="_blank">+353862393272    


_______________________________________________
aerogear-dev mailing list
[hidden email]
https://lists.jboss.org/mailman/listinfo/aerogear-dev
Reply | Threaded
Open this post in threaded view
|  
Report Content as Inappropriate

Re: [aerogear-dev] Java-Jenkins-client API

Matthias Wessendorf
0.3.8 is on its way to maven central

On Wed, Aug 2, 2017 at 1:53 PM, Wei Li <[hidden email]> wrote:
@Matthias: https://github.com/aerogear/java-client-api/pull/6

On Wed, Aug 2, 2017 at 12:44 PM, Wei Li <[hidden email]> wrote:
I am looking into this now.

On Wed, Aug 2, 2017 at 12:38 PM, Matthias Wessendorf <[hidden email]> wrote:
Hi,

on the digger_dev branch, I get:

[ERROR] COMPILATION ERROR : 
[INFO] -------------------------------------------------------------
[ERROR] /home/Matthias/Work/AeroGear/java-client-api/jenkins-client-it-docker/src/test/java/com/offbytwo/jenkins/integration/NoExecutorStartedManageCredentialsIT.java:[85,9] cannot find symbol
  symbol:   class AppleDeveloperProfileCredential
  location: class com.offbytwo.jenkins.integration.NoExecutorStartedManageCredentialsIT
[ERROR] /home/Matthias/Work/AeroGear/java-client-api/jenkins-client-it-docker/src/test/java/com/offbytwo/jenkins/integration/NoExecutorStartedManageCredentialsIT.java:[85,63] cannot find symbol
  symbol:   class AppleDeveloperProfileCredential
  location: class com.offbytwo.jenkins.integration.NoExecutorStartedManageCredentialsIT
[INFO] 2 errors 
[INFO] -------------------------------------------------------------
[INFO] ------------------------------------------------------------------------
[INFO] Reactor Summary:
[INFO] 
[INFO] Jenkins API client for Java ........................ SUCCESS [  1.810 s]
[INFO] Jenkins API client for Java :: The Client. ......... SUCCESS [ 12.036 s]
[INFO] Jenkins API client for Java :: IT Docker ........... FAILURE [  0.236 s]
[INFO] ------------------------------------------------------------------------
[INFO] BUILD FAILURE
[INFO] ------------------------------------------------------------------------
[INFO] Total time: 14.336 s
[INFO] Finished at: 2017-08-02T13:36:27+02:00
[INFO] Final Memory: 61M/1356M
[INFO] ------------------------------------------------------------------------
[ERROR] Failed to execute goal org.apache.maven.plugins:maven-compiler-plugin:3.6.0:testCompile (default-testCompile) on project jenkins-client-it-docker: Compilation failure: Compilation failure:
[ERROR] /home/Matthias/Work/AeroGear/java-client-api/jenkins-client-it-docker/src/test/java/com/offbytwo/jenkins/integration/NoExecutorStartedManageCredentialsIT.java:[85,9] cannot find symbol
[ERROR] symbol:   class AppleDeveloperProfileCredential
[ERROR] location: class com.offbytwo.jenkins.integration.NoExecutorStartedManageCredentialsIT
[ERROR] /home/Matthias/Work/AeroGear/java-client-api/jenkins-client-it-docker/src/test/java/com/offbytwo/jenkins/integration/NoExecutorStartedManageCredentialsIT.java:[85,63] cannot find symbol
[ERROR] symbol:   class AppleDeveloperProfileCredential
[ERROR] location: class com.offbytwo.jenkins.integration.NoExecutorStartedManageCredentialsIT
[ERROR] -> [Help 1]
[ERROR] 
[ERROR] To see the full stack trace of the errors, re-run Maven with the -e switch.
[ERROR] Re-run Maven using the -X switch to enable full debug logging.
[ERROR] 





--

_______________________________________________
aerogear-dev mailing list
[hidden email]
https://lists.jboss.org/mailman/listinfo/aerogear-dev



--

WEI LI

SENIOR SOFTWARE ENGINEER

Red Hat Mobile

[hidden email]    M: <a href="tel:+353862393272" style="color:rgb(0,136,206);font-size:11px;margin:0px" target="_blank">+353862393272    




--

WEI LI

SENIOR SOFTWARE ENGINEER

Red Hat Mobile

[hidden email]    M: <a href="tel:+353862393272" style="color:rgb(0,136,206);font-size:11px;margin:0px" target="_blank">+353862393272    


_______________________________________________
aerogear-dev mailing list
[hidden email]
https://lists.jboss.org/mailman/listinfo/aerogear-dev



--

_______________________________________________
aerogear-dev mailing list
[hidden email]
https://lists.jboss.org/mailman/listinfo/aerogear-dev
Loading...